{"text_format":"1","workbook":"xlsx","n_sheets":7,"sheets":["Home","Inputs","Summary","Print Friendly Summary","Glossary of terms for inputs","LSA Chart","LSDBA Chart"],"not_rendered":{"charts":2,"images":1,"macros":1,"external_links":0,"defined_names":1,"comments":0,"pivot_tables":0},"unopened":[],"bounds":{"document_bytes":16777216,"sheet_cells":100000,"rows_first":2000,"rows_last":500,"rows_between":2000,"halvings":0,"cell_chars":16384,"cell_head_chars":4096},"cells_cut":0,"cells_raw":0,"read":"whole","date_system":"1900"}

{"sheet":"Home","index":0,"n_rows":21,"n_cols":12,"rows_kept":21,"cut":false,"hidden":false,"merged":[[20,4,20,10],[13,1,13,10],[4,1,10,11],[0,1,0,7]]}
[null,"LSA/LSDBA Modelling Tool\nBuilt by M&G",null,null,null,null,null,null,null,null,null,"2026/27"]
[]
[null,"This tool is for UK financial professionals only."]
[null,"Important information about this tool"]
[null,"This tool allows you to estimate the potential LSA and LSDBA availability for your client.\nWe have assumed the user is familiar with HMRC rules on pension benefits and the operation of the LSA and LSDBA.  \nThe tool does not cater for those with Enhanced Protection with protected tax free cash, unless the protection is 25%. \nThis tool is not a personal illustration and the values presented do not suggest any recommendation and should not be taken as offering advice.\nThe figures represent only potential growth and LSA and LSDBA availability over the terms shown and is not an indicator of future performance.\nThe tool is based on our current understanding of HMRC rules and practice relating to the operation of the LSA & LSDBA. \nTax rules can change and the impact of taxation (and any tax reliefs) depends on individual's circumstances.\nEvery care has been taken to the accuracy of this tool, but it must be appreciated that we cannot accept any responsibility for loss, however caused, suffered by any person who has acted or refrained from acting as a result of material contained in this tool.\nRed figures indicate an input error e.g. a benefit payment higher than the available fund.\nWhere a field has a red tag in the top right corner this provides further information about the figures calculated.\nThe value of an investment can go down as well as up. Your clients may get back less than they have paid in.\nAll benefit payments are gross and don't factor in any tax the individual may be liable for.\nThis tool will cease to operate at the end of the tax year shown above."]
[]
[]
[]
[]
[]
[]
[]
[null,"Assumptions used in this tool"]
[null,"Assumes all pre 24 and post 24 drawdowns are each held in a single arrangement."]
[null,"LSA/LSDBA used elsewhere is immediately after any LSA/LSDBA used in year."]
[null,"All moves to drawdown/UFPLS allow tax free amount of the lower of 25% of fund movement, the available LSA and available LSDBA."]
[null,"Benefits and contributions are annual in advance."]
[null,"Growth is applied annually in arrears"]
[null,"Death is assumed to occur at the end of the year."]
[]
{"$rows_left_out":2}
{"sheet":"Inputs","index":1,"n_rows":55,"n_cols":55,"rows_kept":55,"cut":false,"hidden":false,"merged":[[1,30,1,32],[6,27,6,29],[7,27,7,29],[5,31,5,36],[6,31,6,36],[7,31,7,36],[3,16,3,20],[7,1,7,4],[11,1,11,5],[1,16,1,20],[3,1,3,5],[6,1,6,4],[3,9,3,14],[1,1,1,13],[11,50,11,52],[11,9,11,23],[11,27,11,33],[11,36,11,40],[11,44,11,45]]}
[null,1,2,3,4,5,null,6,null,7,null,8,9,10,11,12,13,14,15,16,17,18,19,20,21,22,null,23,24,25,26,27,28,29,30,null,31,32,33,34,35,36,null,37,38,40,41,null,42,43,44,45,46]
[null,"Inputs",null,null,null,null,null,null,null,null,null,null,null,null,null,null,null,null,null,null,null,null,null,null,null,null,null,null,null,null,null,null,null,null,null,null,null,null,null,null,null,null,null,null,null,null,null,null,null,"Kill code"]
[null,1,{"$f":"B3+1","v":2},{"$f":"C3+1","v":3},4,5,6,7,null,{"$f":"H3+1","v":8},9,10,11,12,13,14,15,16,17,18,19,20,21,22,23,24,null,{"$f":"Z3+1","v":25},26,27,28,29,30,31,32,null,{"$f":"AI3+1","v":33},34,35,36,37,38,null,{"$f":"AP3+1","v":39},{"$f":"AR3+1","v":40},{"$f":"#REF!+1","v":{"$error":"#REF!"}},{"$error":"#REF!"},null,{"$f":"AU3+1","v":{"$error":"#REF!"}},{"$error":"#REF!"},{"$error":"#REF!"},{"$error":"#REF!"},{"$error":"#REF!"},{"$error":"#REF!"},{"$error":"#REF!"}]
[null,"Assumptions & Values",null,null,null,null,null,null,null,"Available Allowances",null,null,null,null,null,null,"Current Fund Values",null,null,null,null,null,null,null,null,null,null,"Warnings",null,null,null,null,null,null,null,null,null,null,null,null,null,null,null,null,null,null,null,null,null,{"$f":"AND(AX6<TODAY())","v":false}]
[]
[null,null,null,null,null,null,null,null,null,null,null,null,null,null,null,null,"Unvested",null,null,0,0,null,null,null,null,null,null,{"$f":"IF(AX55>0,\" Benefits started pre 57.\",\"\")","v":""},null,null,null,{"$f":"IF(AZ55>0,\"Pre 24 income too high.\",\"\")","v":""},null,null,null,null,null,null,null,null,null,null,null,null,null,null,null,null,null,"2027-04-05"]
[null,"Net fund growth",null,null,null,0,null,null,null,"LSA",null,null,null,268275,268275,null,"Post April 2024 drawdown",null,null,0,0,null,null,null,null,null,null,{"$f":"IF(AY55>0,\" Unvested withdrawals too high.\",\"\")","v":""},null,null,null,{"$f":"IF(AW55>0,\" Contributions post 75.\",\"\")","v":""}]
[null,"Age at start",null,null,null,50,null,null,null,"LSDBA",null,null,null,1073100,1073100,null,"Pre April 2024 drawdown",null,null,0,0,null,null,null,null,null,null,{"$f":"IF(BA55>0,\"Post 24 income too high.\",\"\")","v":""},null,null,null,{"$f":"IF((BB55+BC55)>0,\" Allowances used elsewhere too high\",\"\")","v":""}]
[]
[]
[null,null,null,null,null,null,null,null,null,null,null,null,null,null,null,null,0]
[null,"Available Allowances",null,null,null,null,null,null,null,"Unvested Pot",null,null,null,null,null,null,null,null,null,null,null,null,null,null,null,null,null,{"$f":"Q7","v":"Post April 2024 drawdown"},null,null,null,null,null,null,null,null,{"$f":"Q8","v":"Pre April 2024 drawdown"},null,null,null,null,null,null,null,"Allowances Used Elsewhere",null,null,null,null,null,"Fund Exhaustion"]
[null,"Age","Year","LSA",null,"LSDBA","Unvested Fund to use LSA",null,null,"Fund\n(Start of Year)","Tax Free Cash Payable","Cum Tax Free","Cum Income",0,"Contributions",0,"UFPLS","Tax Free","Income",0,"Drawdown","Tax Free","Designation","Fund \n(End of Year)",null,null,null,"Fund\n(Start of Year)",null,0,null,"Income",null,"Fund \n(End of Year)",null,null,"Fund\n(Start of Year)",null,"Income",null,0,0,0,null,"LSA","LSDBA",null,null,"Cont warning","Benefit age  warning","Unvested","Pre 24","Post 24","LSA elsewhere","LSDBA elsewhere"]
[null,{"$f":"F8","v":50},1,{"$f":"O7","v":268275},null,{"$f":"O8","v":1073100},{"$f":"D14*4","v":1073100},null,null,{"$f":"U6","v":0},{"$f":"J14/4","v":0},{"$f":"R14+V14","v":0},{"$f":"S14+AF14+AM14","v":0},0,0,0,0,{"$f":"MIN(Q14*0.25,D14,F14)","v":0},{"$f":"Q14-R14","v":0},0,0,{"$f":"MIN(U14*0.25,D14-R14,F14-R14)","v":0},{"$f":"U14-V14","v":0},{"$f":"(J14+O14-Q14-U14)*(1+$F$7)","v":0},null,null,null,{"$f":"U7","v":0},null,{"$f":"W14","v":0},null,0,null,{"$f":"(AB14+AD14-AF14)*(1+$F$7)","v":0},null,null,{"$f":"U8","v":0},null,0,null,0,null,0,null,0,0,null,null,{"$f":"AND(O14>0,B14>=75)","v":false},{"$f":"AND(U14+Q14>0,B14<57)","v":false},{"$f":"AND(X14<0)","v":false},{"$f":"AND(AH14<0)","v":false},{"$f":"AND(AO14<0)","v":false},{"$f":"AND(D14-R14-V14-AS14<0)","v":false},{"$f":"AND(D14-R14-V14-AT14<0)","v":false}]
[null,{"$f":"$B$14+C14","v":51},2,{"$f":"MAX(0,D14-R14-V14-AS14)","v":268275},null,{"$f":"MAX(0,F14-R14-V14-AT14)","v":1073100},{"$f":"D15*4","v":1073100},null,null,{"$f":"MAX(0,X14)","v":0},{"$f":"J15/4","v":0},{"$f":"L14+R15+V15","v":0},{"$f":"M14+S15+AF15+AM15","v":0},0,0,0,0,0,{"$f":"Q15-R15","v":0},0,0,0,{"$f":"U15-V15","v":0},0,null,null,null,{"$f":"AH14","v":0},null,0,null,0,null,{"$f":"(AB15+AD15-AF15)*(1+$F$7)","v":0},null,null,{"$f":"AO14","v":0},null,0,null,0,null,0,null,0,0,null,null,false,false,false,false,false,false,false]
[null,{"$f":"$B$14+C15","v":52},3,268275,null,1073100,1073100,null,null,{"$f":"MAX(0,X15)","v":0},0,{"$f":"L15+R16+V16","v":0},{"$f":"M15+S16+AF16+AM16","v":0},0,0,0,0,0,0,0,0,0,0,0,null,null,null,{"$f":"AH15","v":0},null,0,null,0,null,0,null,null,{"$f":"AO15","v":0},null,0,null,0,null,0,null,0,0,null,null,false,false,false,false,false,false,false]
[null,53,4,268275,null,1073100,1073100,null,null,0,0,0,0,0,0,0,0,0,0,0,0,0,0,0,null,null,null,0,null,0,null,0,null,0,null,null,0,null,0,null,0,null,0,null,0,0,null,null,false,false,false,false,false,false,false]
[null,54,5,268275,null,1073100,1073100,null,null,0,0,0,0,0,0,0,0,0,0,0,0,0,0,0,null,null,null,0,null,0,null,0,null,0,null,null,0,null,0,null,0,null,0,null,0,0,null,null,false,false,false,false,false,false,false]
[null,55,6,268275,null,1073100,1073100,null,null,0,0,0,0,0,0,0,0,0,0,0,0,0,0,0,null,null,null,0,null,0,null,0,null,0,null,null,0,null,0,null,0,null,0,null,0,0,null,null,false,false,false,false,false,false,false]
[null,56,7,268275,null,1073100,1073100,null,null,0,0,0,0,0,0,0,0,0,0,0,0,0,0,0,null,null,null,0,null,0,null,0,null,0,null,null,0,null,0,null,0,null,0,null,0,0,null,null,false,false,false,false,false,false,false]
{"$rows_left_out":36}
{"sheet":"Summary","index":2,"n_rows":33,"n_cols":10,"rows_kept":33,"cut":false,"hidden":false,"merged":[]}
[null,"Summary"]
[]
[null,"Assumptions & Values",null,null,"Position at Age ",50,null,null,null,{"$f":"(F3-Inputs!B14)","v":0}]
[null,"Net fund growth",{"$f":"Inputs!F7","v":0}]
[null,"Age at start",{"$f":"Inputs!F8","v":50},null,"Fund Values"]
[null,null,null,null,"Unvested",{"$f":"VLOOKUP($F$3,Inputs!B14:BA53,8)","v":0}]
[null,null,null,null,"Post 24",{"$f":"VLOOKUP($F$3,Inputs!B14:BA53,25)","v":0}]
[null,"Available Allowances",null,null,"Pre 24",{"$f":"VLOOKUP($F$3,Inputs!B14:BA53,33)","v":0}]
[null,"LSA",{"$f":"Inputs!O7","v":268275}]
[null,"LSDBA",{"$f":"Inputs!O8","v":1073100},null,"Total tax free",{"$f":"VLOOKUP($F$3,Inputs!B14:BA53,10)","v":0}]
[null,null,null,null,"Total income",{"$f":"VLOOKUP($F$3,Inputs!B14:BA53,11)","v":0}]
[null,"Current Fund Values"]
[null,"Unvested",{"$f":"Inputs!U6","v":0},null,"LSA remaining",{"$f":"VLOOKUP($F$3,Inputs!B14:BA53,3)","v":268275},null,null,null,{"$f":"F13*4","v":1073100}]
[null,"Post April 2024 drawdown",{"$f":"Inputs!U7","v":0},null,null,null,null,null,null,{"$f":"F6","v":0}]
[null,"Pre April 2024 drawdown",{"$f":"Inputs!U8","v":0},null,"\"Ballpark\" Contribution required to fully use LSA",null,null,null,null,{"$f":"J13-J14","v":1073100}]
[null,null,null,null,"As an annual contribution",{"$f":"IF(F3=C5,0,MAX(0,PMT($C$4,J3,0,-J15,1)))","v":0}]
[null,null,null,null,"As a single contribution",{"$f":"IF(F3=C5,0,MAX(0,PV(C4,J3,0,-J15,0)))","v":0}]
[]
[null,null,null,null,"Lump Sum Death Benefit value"]
[null,null,null,null,"Unvested",{"$f":"F6","v":0}]
{"$rows_left_out":14}
{"sheet":"Print Friendly Summary","index":3,"n_rows":33,"n_cols":6,"rows_kept":33,"cut":false,"hidden":false,"merged":[]}
[null,"Summary"]
[]
[null,"Assumptions & Values",null,null,{"$f":"Summary!E3","v":"Position at Age "},{"$f":"Summary!F3","v":50}]
[null,{"$f":"Summary!B4","v":"Net fund growth"},{"$f":"Summary!C4","v":0}]
[null,{"$f":"Summary!B5","v":"Age at start"},{"$f":"Summary!C5","v":50},null,{"$f":"Summary!E5","v":"Fund Values"}]
[null,null,null,null,{"$f":"Summary!E6","v":"Unvested"},{"$f":"Summary!F6","v":0}]
[null,null,null,null,{"$f":"Summary!E7","v":"Post 24"},{"$f":"Summary!F7","v":0}]
[null,{"$f":"Summary!B8","v":"Available Allowances"},null,null,{"$f":"Summary!E8","v":"Pre 24"},{"$f":"Summary!F8","v":0}]
[null,{"$f":"Summary!B9","v":"LSA"},{"$f":"Summary!C9","v":268275}]
[null,{"$f":"Summary!B10","v":"LSDBA"},{"$f":"Summary!C10","v":1073100},null,{"$f":"Summary!E10","v":"Total tax free"},{"$f":"Summary!F10","v":0}]
[null,null,null,null,{"$f":"Summary!E11","v":"Total income"},{"$f":"Summary!F11","v":0}]
[null,{"$f":"Summary!B12","v":"Current Fund Values"}]
[null,{"$f":"Summary!B13","v":"Unvested"},{"$f":"Summary!C13","v":0},null,{"$f":"Summary!E13","v":"LSA remaining"},{"$f":"Summary!F13","v":268275}]
[null,{"$f":"Summary!B14","v":"Post April 2024 drawdown"},{"$f":"Summary!C14","v":0}]
[null,{"$f":"Summary!B15","v":"Pre April 2024 drawdown"},{"$f":"Summary!C15","v":0},null,{"$f":"Summary!E15","v":"\"Ballpark\" Contribution required to fully use LSA"}]
[null,null,null,null,{"$f":"Summary!E16","v":"As an annual contribution"},{"$f":"Summary!F16","v":0}]
[null,null,null,null,{"$f":"Summary!E17","v":"As a single contribution"},{"$f":"Summary!F17","v":0}]
[]
[null,null,null,null,{"$f":"Summary!E19","v":"Lump Sum Death Benefit value"}]
[null,null,null,null,{"$f":"Summary!E20","v":"Unvested"},{"$f":"Summary!F20","v":0}]
{"$rows_left_out":14}
{"sheet":"Glossary of terms for inputs","index":4,"n_rows":25,"n_cols":4,"rows_kept":25,"cut":false,"hidden":false,"merged":[[24,1,24,2],[25,1,25,2],[26,1,26,2],[27,1,27,2],[18,1,18,2],[19,1,19,2],[20,1,20,2],[21,1,21,2],[22,1,22,2],[23,1,23,2],[17,1,17,3],[2,1,3,1],[4,1,5,1],[6,1,8,1],[9,1,11,1],[14,1,15,1]]}
[]
[null,"Section","Input Name","Description"]
[null,{"$f":"Inputs!B4","v":"Assumptions & Values"},{"$f":"Inputs!B7","v":"Net fund growth"},"This is the fund growth after product and adviser charges have been taken into account. "]
[null,null,{"$f":"Inputs!B8","v":"Age at start"},"The current age for the client that you wish to start modelling for. "]
[null,{"$f":"Inputs!J4","v":"Available Allowances"},{"$f":"Inputs!J7","v":"LSA"},"The starting value of the available Lump Sum Allowance that the client has available. "]
[null,null,{"$f":"Inputs!J8","v":"LSDBA"},"The starting value of the available Lump Sum and Death Benefits Allowance that the client has available. "]
[null,{"$f":"Inputs!Q4","v":"Current Fund Values"},{"$f":"Inputs!Q6","v":"Unvested"},"The value of the uncrysttlised money purchase pots that are to be modelled. "]
[null,null,{"$f":"Inputs!Q7","v":"Post April 2024 drawdown"},"This is for any funds designated to drawdown on or after 6 April 2024, this is important as these funds ARE tested against the LSDBA if death benefits are paid as a lump sum. "]
[null,null,{"$f":"Inputs!Q8","v":"Pre April 2024 drawdown"},"This is for any funds designated to drawdown prior to 6 April 2024, this is important as these funds are not tested against the LSDBA if death benefits are paid as a lump sum. "]
[null,{"$f":"Inputs!J12","v":"Unvested Pot"},{"$f":"Inputs!O13","v":"Contributions"},"The gross value (including tax relief where applicable) of any pension contributions made. "]
[null,null,{"$f":"Inputs!Q13","v":"UFPLS"},"The gross value of an UFPLS to be taken, the tax free element will be the higher of 25% of the gross value, or the available LSA/LSDBA. "]
[null,null,{"$f":"Inputs!U13","v":"Drawdown"},"The gross value of amounts to be crystallised for drawdown designations. PCLS is assumed to be the higher of 25% of the gross value, or the available LSA/LSDBA."]
[null,{"$f":"Inputs!AB12","v":"Post April 2024 drawdown"},{"$f":"Inputs!AF13","v":"Income"},"The gross income the client will withdraw from the plan."]
[null,{"$f":"Inputs!AK12","v":"Pre April 2024 drawdown"},{"$f":"Inputs!AM13","v":"Income"},"The gross income the client will withdraw from the plan."]
[null,{"$f":"Inputs!AS12","v":"Allowances Used Elsewhere"},{"$f":"Inputs!AS13","v":"LSA"},"The amount of LSA used up by having a RBCE from schemes not included in this model (e.g. Defined Benefit schemes paying a PCLS)."]
[null,null,{"$f":"Inputs!AT13","v":"LSDBA"},"The amount of LSDBA used up by having a RBCE from schemes not included in this model (e.g. Defined Benefit schemes paying a PCLS)."]
[]
[null,"Further Resources"]
[null,"Lump Sum Allowance (LSA)",null,"https://www.mandg.com/wealth/adviser-services/tech-matters/pensions/benefit-limits/lump-sum-allowance"]
[null,"Lump Sum and Death Benefit Allowance (LSDBA)",null,"https://www.mandg.com/wealth/adviser-services/tech-matters/pensions/benefit-limits/lump-sum-and-death-benefit-allowance"]
{"$rows_left_out":6}
{"sheet":"LSA Chart","index":5,"n_rows":47,"n_cols":18,"rows_kept":47,"cut":false,"hidden":false,"merged":[]}
[]
[]
[]
[]
[]
[]
[null,null,null,null,"Age","Tax Free","Income",{"$f":"Inputs!J12","v":"Unvested Pot"},{"$f":"Inputs!AB12","v":"Post April 2024 drawdown"},{"$f":"Inputs!AK12","v":"Pre April 2024 drawdown"},{"$f":"Inputs!D13","v":"LSA"},{"$f":"Inputs!F13","v":"LSDBA"},{"$f":"Inputs!G13","v":"Unvested Fund to use LSA"},{"$f":"Inputs!K13","v":"Tax Free Cash Payable"},"LSA avialable EOY"]
[null,null,null,null,{"$f":"Inputs!B14","v":50},{"$f":"Inputs!L14","v":0},{"$f":"Inputs!M14","v":0},{"$f":"Inputs!X14","v":0},{"$f":"Inputs!AH14","v":0},{"$f":"Inputs!AO14","v":0},{"$f":"Inputs!D14","v":268275},{"$f":"Inputs!F14","v":1073100},{"$f":"Inputs!G14","v":1073100},{"$f":"Inputs!K14","v":0},{"$f":"K8-F8","v":268275},null,{"$f":"$K$8-F8","v":268275},{"$f":"O8+F8","v":268275}]
[null,null,null,null,{"$f":"Inputs!B15","v":51},{"$f":"Inputs!L15","v":0},{"$f":"Inputs!M15","v":0},{"$f":"Inputs!X15","v":0},{"$f":"Inputs!AH15","v":0},{"$f":"Inputs!AO15","v":0},{"$f":"Inputs!D15","v":268275},{"$f":"Inputs!F15","v":1073100},{"$f":"Inputs!G15","v":1073100},{"$f":"Inputs!K15","v":0},{"$f":"K9-F9","v":268275},null,{"$f":"$K$8-F9","v":268275},{"$f":"Q9+F9","v":268275}]
[null,null,null,null,{"$f":"Inputs!B16","v":52},{"$f":"Inputs!L16","v":0},{"$f":"Inputs!M16","v":0},{"$f":"Inputs!X16","v":0},{"$f":"Inputs!AH16","v":0},{"$f":"Inputs!AO16","v":0},{"$f":"Inputs!D16","v":268275},{"$f":"Inputs!F16","v":1073100},{"$f":"Inputs!G16","v":1073100},{"$f":"Inputs!K16","v":0},268275,null,268275,{"$f":"Q10+F10","v":268275}]
[null,null,null,null,{"$f":"Inputs!B17","v":53},{"$f":"Inputs!L17","v":0},{"$f":"Inputs!M17","v":0},{"$f":"Inputs!X17","v":0},{"$f":"Inputs!AH17","v":0},{"$f":"Inputs!AO17","v":0},{"$f":"Inputs!D17","v":268275},{"$f":"Inputs!F17","v":1073100},{"$f":"Inputs!G17","v":1073100},{"$f":"Inputs!K17","v":0},268275,null,268275,268275]
[null,null,null,null,{"$f":"Inputs!B18","v":54},{"$f":"Inputs!L18","v":0},{"$f":"Inputs!M18","v":0},{"$f":"Inputs!X18","v":0},{"$f":"Inputs!AH18","v":0},{"$f":"Inputs!AO18","v":0},{"$f":"Inputs!D18","v":268275},{"$f":"Inputs!F18","v":1073100},{"$f":"Inputs!G18","v":1073100},{"$f":"Inputs!K18","v":0},268275,null,268275,268275]
[null,null,null,null,{"$f":"Inputs!B19","v":55},{"$f":"Inputs!L19","v":0},{"$f":"Inputs!M19","v":0},{"$f":"Inputs!X19","v":0},{"$f":"Inputs!AH19","v":0},{"$f":"Inputs!AO19","v":0},{"$f":"Inputs!D19","v":268275},{"$f":"Inputs!F19","v":1073100},{"$f":"Inputs!G19","v":1073100},{"$f":"Inputs!K19","v":0},268275,null,268275,268275]
[null,null,null,null,{"$f":"Inputs!B20","v":56},{"$f":"Inputs!L20","v":0},{"$f":"Inputs!M20","v":0},{"$f":"Inputs!X20","v":0},{"$f":"Inputs!AH20","v":0},{"$f":"Inputs!AO20","v":0},{"$f":"Inputs!D20","v":268275},{"$f":"Inputs!F20","v":1073100},{"$f":"Inputs!G20","v":1073100},{"$f":"Inputs!K20","v":0},268275,null,268275,268275]
[null,null,null,null,{"$f":"Inputs!B21","v":57},{"$f":"Inputs!L21","v":0},{"$f":"Inputs!M21","v":0},{"$f":"Inputs!X21","v":0},{"$f":"Inputs!AH21","v":0},{"$f":"Inputs!AO21","v":0},{"$f":"Inputs!D21","v":268275},{"$f":"Inputs!F21","v":1073100},{"$f":"Inputs!G21","v":1073100},{"$f":"Inputs!K21","v":0},268275,null,268275,268275]
[null,null,null,null,{"$f":"Inputs!B22","v":58},{"$f":"Inputs!L22","v":0},{"$f":"Inputs!M22","v":0},{"$f":"Inputs!X22","v":0},{"$f":"Inputs!AH22","v":0},{"$f":"Inputs!AO22","v":0},{"$f":"Inputs!D22","v":268275},{"$f":"Inputs!F22","v":1073100},{"$f":"Inputs!G22","v":1073100},{"$f":"Inputs!K22","v":0},268275,null,268275,268275]
[null,null,null,null,{"$f":"Inputs!B23","v":59},{"$f":"Inputs!L23","v":0},{"$f":"Inputs!M23","v":0},{"$f":"Inputs!X23","v":0},{"$f":"Inputs!AH23","v":0},{"$f":"Inputs!AO23","v":0},{"$f":"Inputs!D23","v":268275},{"$f":"Inputs!F23","v":1073100},{"$f":"Inputs!G23","v":1073100},{"$f":"Inputs!K23","v":0},268275,null,268275,268275]
[null,null,null,null,{"$f":"Inputs!B24","v":60},{"$f":"Inputs!L24","v":0},{"$f":"Inputs!M24","v":0},{"$f":"Inputs!X24","v":0},{"$f":"Inputs!AH24","v":0},{"$f":"Inputs!AO24","v":0},{"$f":"Inputs!D24","v":268275},{"$f":"Inputs!F24","v":1073100},{"$f":"Inputs!G24","v":1073100},{"$f":"Inputs!K24","v":0},268275,null,268275,268275]
[null,null,null,null,{"$f":"Inputs!B25","v":61},{"$f":"Inputs!L25","v":0},{"$f":"Inputs!M25","v":0},{"$f":"Inputs!X25","v":0},{"$f":"Inputs!AH25","v":0},{"$f":"Inputs!AO25","v":0},{"$f":"Inputs!D25","v":268275},{"$f":"Inputs!F25","v":1073100},{"$f":"Inputs!G25","v":1073100},{"$f":"Inputs!K25","v":0},268275,null,268275,268275]
[null,null,null,null,{"$f":"Inputs!B26","v":62},{"$f":"Inputs!L26","v":0},{"$f":"Inputs!M26","v":0},{"$f":"Inputs!X26","v":0},{"$f":"Inputs!AH26","v":0},{"$f":"Inputs!AO26","v":0},{"$f":"Inputs!D26","v":268275},{"$f":"Inputs!F26","v":1073100},{"$f":"Inputs!G26","v":1073100},{"$f":"Inputs!K26","v":0},268275,null,268275,268275]
{"$rows_left_out":28}
{"sheet":"LSDBA Chart","index":6,"n_rows":47,"n_cols":12,"rows_kept":47,"cut":false,"hidden":false,"merged":[]}
[]
[]
[]
[]
[]
[]
[null,null,null,null,"Age","Tax Free","Income",{"$f":"Inputs!J12","v":"Unvested Pot"},{"$f":"Inputs!AB12","v":"Post April 2024 drawdown"},{"$f":"Inputs!AK12","v":"Pre April 2024 drawdown"},{"$f":"Inputs!D13","v":"LSA"},{"$f":"Inputs!F13","v":"LSDBA"}]
[null,null,null,null,{"$f":"Inputs!B14","v":50},{"$f":"Inputs!L14","v":0},{"$f":"Inputs!M14","v":0},{"$f":"Inputs!X14","v":0},{"$f":"Inputs!AH14","v":0},{"$f":"Inputs!AO14","v":0},{"$f":"Inputs!D14","v":268275},{"$f":"Inputs!F14","v":1073100}]
[null,null,null,null,{"$f":"Inputs!B15","v":51},{"$f":"Inputs!L15","v":0},{"$f":"Inputs!M15","v":0},{"$f":"Inputs!X15","v":0},{"$f":"Inputs!AH15","v":0},{"$f":"Inputs!AO15","v":0},{"$f":"Inputs!D15","v":268275},{"$f":"Inputs!F15","v":1073100}]
[null,null,null,null,{"$f":"Inputs!B16","v":52},{"$f":"Inputs!L16","v":0},{"$f":"Inputs!M16","v":0},{"$f":"Inputs!X16","v":0},{"$f":"Inputs!AH16","v":0},{"$f":"Inputs!AO16","v":0},{"$f":"Inputs!D16","v":268275},{"$f":"Inputs!F16","v":1073100}]
[null,null,null,null,{"$f":"Inputs!B17","v":53},{"$f":"Inputs!L17","v":0},{"$f":"Inputs!M17","v":0},{"$f":"Inputs!X17","v":0},{"$f":"Inputs!AH17","v":0},{"$f":"Inputs!AO17","v":0},{"$f":"Inputs!D17","v":268275},{"$f":"Inputs!F17","v":1073100}]
[null,null,null,null,{"$f":"Inputs!B18","v":54},{"$f":"Inputs!L18","v":0},{"$f":"Inputs!M18","v":0},{"$f":"Inputs!X18","v":0},{"$f":"Inputs!AH18","v":0},{"$f":"Inputs!AO18","v":0},{"$f":"Inputs!D18","v":268275},{"$f":"Inputs!F18","v":1073100}]
[null,null,null,null,{"$f":"Inputs!B19","v":55},{"$f":"Inputs!L19","v":0},{"$f":"Inputs!M19","v":0},{"$f":"Inputs!X19","v":0},{"$f":"Inputs!AH19","v":0},{"$f":"Inputs!AO19","v":0},{"$f":"Inputs!D19","v":268275},{"$f":"Inputs!F19","v":1073100}]
[null,null,null,null,{"$f":"Inputs!B20","v":56},{"$f":"Inputs!L20","v":0},{"$f":"Inputs!M20","v":0},{"$f":"Inputs!X20","v":0},{"$f":"Inputs!AH20","v":0},{"$f":"Inputs!AO20","v":0},{"$f":"Inputs!D20","v":268275},{"$f":"Inputs!F20","v":1073100}]
[null,null,null,null,{"$f":"Inputs!B21","v":57},{"$f":"Inputs!L21","v":0},{"$f":"Inputs!M21","v":0},{"$f":"Inputs!X21","v":0},{"$f":"Inputs!AH21","v":0},{"$f":"Inputs!AO21","v":0},{"$f":"Inputs!D21","v":268275},{"$f":"Inputs!F21","v":1073100}]
[null,null,null,null,{"$f":"Inputs!B22","v":58},{"$f":"Inputs!L22","v":0},{"$f":"Inputs!M22","v":0},{"$f":"Inputs!X22","v":0},{"$f":"Inputs!AH22","v":0},{"$f":"Inputs!AO22","v":0},{"$f":"Inputs!D22","v":268275},{"$f":"Inputs!F22","v":1073100}]
[null,null,null,null,{"$f":"Inputs!B23","v":59},{"$f":"Inputs!L23","v":0},{"$f":"Inputs!M23","v":0},{"$f":"Inputs!X23","v":0},{"$f":"Inputs!AH23","v":0},{"$f":"Inputs!AO23","v":0},{"$f":"Inputs!D23","v":268275},{"$f":"Inputs!F23","v":1073100}]
[null,null,null,null,{"$f":"Inputs!B24","v":60},{"$f":"Inputs!L24","v":0},{"$f":"Inputs!M24","v":0},{"$f":"Inputs!X24","v":0},{"$f":"Inputs!AH24","v":0},{"$f":"Inputs!AO24","v":0},{"$f":"Inputs!D24","v":268275},{"$f":"Inputs!F24","v":1073100}]
[null,null,null,null,{"$f":"Inputs!B25","v":61},{"$f":"Inputs!L25","v":0},{"$f":"Inputs!M25","v":0},{"$f":"Inputs!X25","v":0},{"$f":"Inputs!AH25","v":0},{"$f":"Inputs!AO25","v":0},{"$f":"Inputs!D25","v":268275},{"$f":"Inputs!F25","v":1073100}]
[null,null,null,null,{"$f":"Inputs!B26","v":62},{"$f":"Inputs!L26","v":0},{"$f":"Inputs!M26","v":0},{"$f":"Inputs!X26","v":0},{"$f":"Inputs!AH26","v":0},{"$f":"Inputs!AO26","v":0},{"$f":"Inputs!D26","v":268275},{"$f":"Inputs!F26","v":1073100}]
{"$rows_left_out":27}