{"text_format":"1","workbook":"xlsx","n_sheets":23,"sheets":["Homepage","Inputs","Summary","Inputs - Printer Friendly","Summary - Printer Friendly","Parameters_Inc Calcs","Allowances Remaining","CGT","Yr 1","Yr 2","Yr 3","Yr 4","Yr 5","Yr 6","Yr 7","Yr 8","Yr 9","Yr 10","Income","Bonds","Onshore Bond Calcs","Offshore Bond Calcs","Port Analysis"],"not_rendered":{"charts":0,"images":0,"macros":1,"external_links":0,"defined_names":1,"comments":4,"pivot_tables":0},"unopened":[],"bounds":{"document_bytes":16777216,"sheet_cells":100000,"rows_first":2000,"rows_last":500,"rows_between":2000,"halvings":0,"cell_chars":16384,"cell_head_chars":4096},"cells_cut":0,"cells_raw":0,"read":"whole","date_system":"1900"}

{"sheet":"Homepage","index":0,"n_rows":25,"n_cols":18,"rows_kept":25,"cut":false,"hidden":false,"merged":[[21,7,21,8],[22,7,22,8],[24,1,33,10],[0,1,0,2],[0,4,0,5],[3,1,3,2],[3,4,3,10],[6,1,6,2],[7,1,20,10]]}
[null,"Tax Wrapper Comparison Tool\nbuilt by M&G",null,null,"Tax Year 2022/23"]
[]
[]
[]
[null,"This tool is for UK financial advisers only. ",null,null,null,null,null,null,null,null,null,null,null,null,null,null,null,"Assumptions"]
[null,null,null,null,null,null,null,null,null,null,null,null,null,null,null,null,null,"Uses UK rates for NSND"]
{"$rows_left_out":20}
{"sheet":"Inputs","index":1,"n_rows":36,"n_cols":18,"rows_kept":36,"cut":false,"hidden":false,"merged":[[27,1,28,1],[25,8,26,13],[0,1,0,4],[14,1,14,6],[14,8,14,13],[9,1,9,2],[9,8,9,11],[3,13,4,14],[5,13,5,14]]}
[null,"Tax Wrapper Comparison Tool\nbuilt by M&G",null,null,null,null,null,{"$f":"AND(C3>0,C5>0,SUM(L4:L6)>0%)","v":false},null,null,null,{"$f":"Homepage!E1","v":"Tax Year 2022/23"}]
[]
[null,"Invested Amount",0,null,null,null,null,null,"Investment Yields"]
[null,null,null,null,null,null,null,null,"Savings income",null,null,0,null,"Onshore Bond \nInternal Tax Rate"]
[null,"Year of encashment (5 to 10 only)",null,null,null,null,null,null,"Dividend Return",null,null,0]
[null,null,null,null,null,null,null,null,"Capital Gain",null,null,0,null,{"$f":"IF(H1=FALSE,0%,Bonds!F5)","v":0}]
{"$rows_left_out":31}
{"sheet":"Summary","index":2,"n_rows":43,"n_cols":14,"rows_kept":43,"cut":false,"hidden":false,"merged":[[32,1,35,2],[1,4,1,13],[3,1,8,2],[12,1,20,2],[24,1,26,2],[27,1,27,2],[28,1,28,2]]}
[]
[null,null,null,null,"Year"]
[null,null,null,null,1,{"$f":"E3+1","v":2},{"$f":"F3+1","v":3},4,5,6,7,8,9,10]
[null,"Client Income",null,"Non Savings, Non Dividend",{"$f":"'Yr 1'!$F$9","v":0},{"$f":"'Yr 2'!$F$9","v":0},{"$f":"'Yr 3'!$F$9","v":0},{"$f":"'Yr 4'!$F$9","v":0},{"$f":"'Yr 5'!$F$9","v":0},{"$f":"'Yr 6'!$F$9","v":0},{"$f":"'Yr 7'!$F$9","v":0},{"$f":"'Yr 8'!$F$9","v":0},{"$f":"'Yr 9'!$F$9","v":0},{"$f":"'Yr 10'!$F$9","v":0}]
[null,null,null,"Existing Savings",{"$f":"'Yr 1'!$F$10","v":0},{"$f":"'Yr 2'!$F$10","v":0},{"$f":"'Yr 3'!$F$10","v":0},{"$f":"'Yr 4'!$F$10","v":0},{"$f":"'Yr 5'!$F$10","v":0},{"$f":"'Yr 6'!$F$10","v":0},{"$f":"'Yr 7'!$F$10","v":0},{"$f":"'Yr 8'!$F$10","v":0},{"$f":"'Yr 9'!$F$10","v":0},{"$f":"'Yr 10'!$F$10","v":0}]
[null,null,null,"Existing Dividend",{"$f":"'Yr 1'!$F$11","v":0},{"$f":"'Yr 2'!$F$11","v":0},{"$f":"'Yr 3'!$F$11","v":0},{"$f":"'Yr 4'!$F$11","v":0},{"$f":"'Yr 5'!$F$11","v":0},{"$f":"'Yr 6'!$F$11","v":0},{"$f":"'Yr 7'!$F$11","v":0},{"$f":"'Yr 8'!$F$11","v":0},{"$f":"'Yr 9'!$F$11","v":0},{"$f":"'Yr 10'!$F$11","v":0}]
{"$rows_left_out":38}
{"sheet":"Inputs - Printer Friendly","index":3,"n_rows":36,"n_cols":18,"rows_kept":36,"cut":false,"hidden":false,"merged":[[27,1,28,1],[25,8,26,13],[0,1,0,4],[3,13,4,14],[5,13,5,14],[9,1,9,2],[9,8,9,11],[14,1,14,6],[14,8,14,13]]}
[null,"Tax Wrapper Comparison Tool\nbuilt by M&G",null,null,null,null,null,null,null,null,null,{"$f":"Homepage!E1","v":"Tax Year 2022/23"}]
[]
[null,"Invested Amount",{"$f":"Inputs!C3","v":0},null,null,null,null,null,"Investment Yields"]
[null,null,null,null,null,null,null,null,"Savings income",null,null,{"$f":"Inputs!L4","v":0},null,"Onshore Bond \nInternal Tax Rate"]
[null,"Year of encashment (5 to 10 only)",{"$f":"Inputs!C5","v":0},null,null,null,null,null,"Dividend Return",null,null,{"$f":"Inputs!L5","v":0}]
[null,null,null,null,null,null,null,null,"Capital Gain",null,null,{"$f":"Inputs!L6","v":0},null,{"$f":"Inputs!N6","v":0}]
{"$rows_left_out":31}
{"sheet":"Summary - Printer Friendly","index":4,"n_rows":43,"n_cols":14,"rows_kept":43,"cut":false,"hidden":false,"merged":[[32,1,35,2],[1,4,1,13],[3,1,8,2],[12,1,20,2],[24,1,26,2],[27,1,27,2],[28,1,28,2]]}
[]
[null,null,null,null,"Year"]
[null,null,null,null,1,{"$f":"E3+1","v":2},{"$f":"F3+1","v":3},4,5,6,7,8,9,10]
[null,"Client Income",null,"Non Savings, Non Dividend",{"$f":"'Yr 1'!$F$9","v":0},{"$f":"'Yr 2'!$F$9","v":0},{"$f":"'Yr 3'!$F$9","v":0},{"$f":"'Yr 4'!$F$9","v":0},{"$f":"'Yr 5'!$F$9","v":0},{"$f":"'Yr 6'!$F$9","v":0},{"$f":"'Yr 7'!$F$9","v":0},{"$f":"'Yr 8'!$F$9","v":0},{"$f":"'Yr 9'!$F$9","v":0},{"$f":"'Yr 10'!$F$9","v":0}]
[null,null,null,"Existing Savings",{"$f":"'Yr 1'!$F$10","v":0},{"$f":"'Yr 2'!$F$10","v":0},{"$f":"'Yr 3'!$F$10","v":0},{"$f":"'Yr 4'!$F$10","v":0},{"$f":"'Yr 5'!$F$10","v":0},{"$f":"'Yr 6'!$F$10","v":0},{"$f":"'Yr 7'!$F$10","v":0},{"$f":"'Yr 8'!$F$10","v":0},{"$f":"'Yr 9'!$F$10","v":0},{"$f":"'Yr 10'!$F$10","v":0}]
[null,null,null,"Existing Dividend",{"$f":"'Yr 1'!$F$11","v":0},{"$f":"'Yr 2'!$F$11","v":0},{"$f":"'Yr 3'!$F$11","v":0},{"$f":"'Yr 4'!$F$11","v":0},{"$f":"'Yr 5'!$F$11","v":0},{"$f":"'Yr 6'!$F$11","v":0},{"$f":"'Yr 7'!$F$11","v":0},{"$f":"'Yr 8'!$F$11","v":0},{"$f":"'Yr 9'!$F$11","v":0},{"$f":"'Yr 10'!$F$11","v":0}]
{"$rows_left_out":38}
{"sheet":"Parameters_Inc Calcs","index":5,"n_rows":18,"n_cols":13,"rows_kept":18,"cut":false,"hidden":true,"merged":[]}
[]
[null,"PA standard",12570]
[null,"ANI Limit",100000,"Divis","Other","Gains",null,null,"Suicide Code",{"$f":"TODAY()","v":"2023-01-17"}]
[null,"Basic Rate Band",37700,8.7499999999999994E-2,0.2,0.1,null,null,null,"2023-04-05"]
[null,"Higher Threshold",50270,0.33750000000000002,0.4,0.2]
[null,"Higher Rate Band Year 1",112300,"%"]
{"$rows_left_out":13}
{"sheet":"Allowances Remaining","index":6,"n_rows":20,"n_cols":8,"rows_kept":20,"cut":false,"hidden":true,"merged":[[0,2,0,6],[13,2,13,6],[17,2,17,6]]}
[null,null,"Collectives"]
[null,"Year","Unused PA (from divi after)","Unused SSR (from savings after)","Unused PSA (from savings after)","Remaining Basic Rate (from Divi After)","Remaining Higher Rate (from Divi After)","CGT Allowance"]
[null,1,{"$f":"'Yr 1'!T30","v":12570},{"$f":"'Yr 1'!$T$18","v":5000},{"$f":"'Yr 1'!$T$19","v":1000},{"$f":"'Yr 1'!$T$31","v":37700},{"$f":"'Yr 1'!$T$32","v":87440},{"$f":"'Yr 1'!$D$43","v":6000}]
[null,{"$f":"B3+1","v":2},{"$f":"'Yr 2'!T30","v":12570},{"$f":"'Yr 2'!$T$18","v":5000},{"$f":"'Yr 2'!$T$19","v":1000},{"$f":"'Yr 2'!$T$31","v":37700},{"$f":"'Yr 2'!$T$32","v":87440},{"$f":"'Yr 2'!$D$43","v":3000}]
[null,{"$f":"B4+1","v":3},{"$f":"'Yr 3'!T30","v":12570},{"$f":"'Yr 3'!$T$18","v":5000},{"$f":"'Yr 3'!$T$19","v":1000},{"$f":"'Yr 3'!$T$31","v":37700},{"$f":"'Yr 3'!$T$32","v":87440},{"$f":"'Yr 3'!$D$43","v":3000}]
[null,4,{"$f":"'Yr 4'!T30","v":12570},{"$f":"'Yr 4'!$T$18","v":5000},{"$f":"'Yr 4'!$T$19","v":1000},{"$f":"'Yr 4'!$T$31","v":37700},{"$f":"'Yr 4'!$T$32","v":87440},{"$f":"'Yr 4'!$D$43","v":3000}]
{"$rows_left_out":15}
{"sheet":"CGT","index":7,"n_rows":33,"n_cols":17,"rows_kept":33,"cut":false,"hidden":true,"merged":[]}
[]
[]
[]
[]
[]
[]
{"$rows_left_out":28}
{"sheet":"Yr 1","index":8,"n_rows":43,"n_cols":30,"rows_kept":43,"cut":false,"hidden":true,"merged":[[0,8,0,12],[0,15,0,19],[28,13,30,13],[28,20,30,20],[18,13,20,13],[18,20,20,20],[7,2,7,3],[7,4,7,5]]}
[null,null,null,null,null,null,null,null,"Before",null,null,null,null,null,null,"AFTER"]
[null,"Year",1,"move year on 1",null,null,null,null,"Allowances:",null,null,null,null,null,null,"Allowances:"]
[null,"Final Year",{"$f":"IF(C2=Inputs!C5,\"Yes\",\"No\")","v":"No"},null,null,null,null,null,"Pers_Allow_Adj",null,null,null,null,null,null,"Pers_Allow_Adj"]
[null,"After Final Year",{"$f":"AND(C2>Inputs!C5)","v":true},null,null,null,null,null,"Tot_Pers_Allow",{"$f":"D22","v":12570},null,null,null,null,null,"Tot_Pers_Allow",{"$f":"F22","v":12570}]
[null,"Investment",{"$f":"CGT!G12","v":0},"move col on 1",null,null,null,null,"Pers_Sav_Allow",{"$f":"D40","v":1000},null,null,null,null,null,"Pers_Sav_Allow",{"$f":"F40","v":1000}]
[null,"Cum Gain",{"$f":"CGT!G16","v":0},"move col on 1"]
{"$rows_left_out":38}
{"sheet":"Yr 2","index":9,"n_rows":43,"n_cols":30,"rows_kept":43,"cut":false,"hidden":true,"merged":[[28,13,30,13],[28,20,30,20],[0,8,0,12],[0,15,0,19],[7,2,7,3],[7,4,7,5],[18,13,20,13],[18,20,20,20]]}
[null,null,null,null,null,null,null,null,"Before",null,null,null,null,null,null,"AFTER"]
[null,"Year",2,"move year on 1",null,null,null,null,"Allowances:",null,null,null,null,null,null,"Allowances:"]
[null,"Final Year",{"$f":"IF(C2=Inputs!C5,\"Yes\",\"No\")","v":"No"},null,null,null,null,null,"Pers_Allow_Adj",null,null,null,null,null,null,"Pers_Allow_Adj"]
[null,"After Final Year",{"$f":"AND(C2>Inputs!C5)","v":true},null,null,null,null,null,"Tot_Pers_Allow",{"$f":"D22","v":12570},null,null,null,null,null,"Tot_Pers_Allow",{"$f":"F22","v":12570}]
[null,"Investment",{"$f":"CGT!H12","v":0},"move col on 1",null,null,null,null,"Pers_Sav_Allow",{"$f":"D40","v":1000},null,null,null,null,null,"Pers_Sav_Allow",{"$f":"F40","v":1000}]
[null,"Cum Gain",{"$f":"CGT!H16","v":0},"move col on 1"]
{"$rows_left_out":38}
{"sheet":"Yr 3","index":10,"n_rows":43,"n_cols":30,"rows_kept":43,"cut":false,"hidden":true,"merged":[[28,13,30,13],[28,20,30,20],[0,8,0,12],[0,15,0,19],[7,2,7,3],[7,4,7,5],[18,13,20,13],[18,20,20,20]]}
[null,null,null,null,null,null,null,null,"Before",null,null,null,null,null,null,"AFTER"]
[null,"Year",3,null,"Amber needs amended when new sheet created",null,null,null,"Allowances:",null,null,null,null,null,null,"Allowances:"]
[null,"Final Year",{"$f":"IF(C2=Inputs!C5,\"Yes\",\"No\")","v":"No"},null,null,null,null,null,"Pers_Allow_Adj",null,null,null,null,null,null,"Pers_Allow_Adj"]
[null,"After Final Year",{"$f":"AND(C2>Inputs!C5)","v":true},null,null,null,null,null,"Tot_Pers_Allow",{"$f":"D22","v":12570},null,null,null,null,null,"Tot_Pers_Allow",{"$f":"F22","v":12570}]
[null,"Investment",{"$f":"CGT!I12","v":0},null,null,null,null,null,"Pers_Sav_Allow",{"$f":"D40","v":1000},null,null,null,null,null,"Pers_Sav_Allow",{"$f":"F40","v":1000}]
[null,"Cum Gain",{"$f":"CGT!I16","v":0}]
{"$rows_left_out":38}
{"sheet":"Yr 4","index":11,"n_rows":43,"n_cols":30,"rows_kept":43,"cut":false,"hidden":true,"merged":[[28,13,30,13],[28,20,30,20],[0,8,0,12],[0,15,0,19],[7,2,7,3],[7,4,7,5],[18,13,20,13],[18,20,20,20]]}
[null,null,null,null,null,null,null,null,"Before",null,null,null,null,null,null,"AFTER"]
[null,"Year",4,null,"Amber needs amended when new sheet created",null,null,null,"Allowances:",null,null,null,null,null,null,"Allowances:"]
[null,"Final Year",{"$f":"IF(C2=Inputs!C5,\"Yes\",\"No\")","v":"No"},null,null,null,null,null,"Pers_Allow_Adj",null,null,null,null,null,null,"Pers_Allow_Adj"]
[null,"After Final Year",{"$f":"AND(C2>Inputs!C5)","v":true},null,null,null,null,null,"Tot_Pers_Allow",{"$f":"D22","v":12570},null,null,null,null,null,"Tot_Pers_Allow",{"$f":"F22","v":12570}]
[null,"Investment",{"$f":"CGT!J12","v":0},null,null,null,null,null,"Pers_Sav_Allow",{"$f":"D40","v":1000},null,null,null,null,null,"Pers_Sav_Allow",{"$f":"F40","v":1000}]
[null,"Cum Gain",{"$f":"CGT!J16","v":0}]
{"$rows_left_out":38}
{"sheet":"Yr 5","index":12,"n_rows":43,"n_cols":30,"rows_kept":43,"cut":false,"hidden":true,"merged":[[28,13,30,13],[28,20,30,20],[0,8,0,12],[0,15,0,19],[7,2,7,3],[7,4,7,5],[18,13,20,13],[18,20,20,20]]}
[null,null,null,null,null,null,null,null,"Before",null,null,null,null,null,null,"AFTER"]
[null,"Year",5,null,"Amber needs amended when new sheet created",null,null,null,"Allowances:",null,null,null,null,null,null,"Allowances:"]
[null,"Final Year",{"$f":"IF(C2=Inputs!C5,\"Yes\",\"No\")","v":"No"},null,null,null,null,null,"Pers_Allow_Adj",null,null,null,null,null,null,"Pers_Allow_Adj"]
[null,"After Final Year",{"$f":"AND(C2>Inputs!C5)","v":true},null,null,null,null,null,"Tot_Pers_Allow",{"$f":"D22","v":12570},null,null,null,null,null,"Tot_Pers_Allow",{"$f":"F22","v":12570}]
[null,"Investment",{"$f":"CGT!K12","v":0},null,null,null,null,null,"Pers_Sav_Allow",{"$f":"D40","v":1000},null,null,null,null,null,"Pers_Sav_Allow",{"$f":"F40","v":1000}]
[null,"Cum Gain",{"$f":"CGT!K16","v":0}]
{"$rows_left_out":38}
{"sheet":"Yr 6","index":13,"n_rows":43,"n_cols":30,"rows_kept":43,"cut":false,"hidden":true,"merged":[[28,13,30,13],[28,20,30,20],[0,8,0,12],[0,15,0,19],[7,2,7,3],[7,4,7,5],[18,13,20,13],[18,20,20,20]]}
[null,null,null,null,null,null,null,null,"Before",null,null,null,null,null,null,"AFTER"]
[null,"Year",6,null,"Amber needs amended when new sheet created",null,null,null,"Allowances:",null,null,null,null,null,null,"Allowances:"]
[null,"Final Year",{"$f":"IF(C2=Inputs!C5,\"Yes\",\"No\")","v":"No"},null,null,null,null,null,"Pers_Allow_Adj",null,null,null,null,null,null,"Pers_Allow_Adj"]
[null,"After Final Year",{"$f":"AND(C2>Inputs!C5)","v":true},null,null,null,null,null,"Tot_Pers_Allow",{"$f":"D22","v":12570},null,null,null,null,null,"Tot_Pers_Allow",{"$f":"F22","v":12570}]
[null,"Investment",{"$f":"CGT!L12","v":0},null,null,null,null,null,"Pers_Sav_Allow",{"$f":"D40","v":1000},null,null,null,null,null,"Pers_Sav_Allow",{"$f":"F40","v":1000}]
[null,"Cum Gain",{"$f":"CGT!L16","v":0}]
{"$rows_left_out":38}
{"sheet":"Yr 7","index":14,"n_rows":43,"n_cols":30,"rows_kept":43,"cut":false,"hidden":true,"merged":[[28,13,30,13],[28,20,30,20],[0,8,0,12],[0,15,0,19],[7,2,7,3],[7,4,7,5],[18,13,20,13],[18,20,20,20]]}
[null,null,null,null,null,null,null,null,"Before",null,null,null,null,null,null,"AFTER"]
[null,"Year",7,null,"Amber needs amended when new sheet created",null,null,null,"Allowances:",null,null,null,null,null,null,"Allowances:"]
[null,"Final Year",{"$f":"IF(C2=Inputs!C5,\"Yes\",\"No\")","v":"No"},null,null,null,null,null,"Pers_Allow_Adj",null,null,null,null,null,null,"Pers_Allow_Adj"]
[null,"After Final Year",{"$f":"AND(C2>Inputs!C5)","v":true},null,null,null,null,null,"Tot_Pers_Allow",{"$f":"D22","v":12570},null,null,null,null,null,"Tot_Pers_Allow",{"$f":"F22","v":12570}]
[null,"Investment",{"$f":"CGT!M12","v":0},null,null,null,null,null,"Pers_Sav_Allow",{"$f":"D40","v":1000},null,null,null,null,null,"Pers_Sav_Allow",{"$f":"F40","v":1000}]
[null,"Cum Gain",{"$f":"CGT!M16","v":0}]
{"$rows_left_out":38}
{"sheet":"Yr 8","index":15,"n_rows":43,"n_cols":30,"rows_kept":43,"cut":false,"hidden":true,"merged":[[28,13,30,13],[28,20,30,20],[0,8,0,12],[0,15,0,19],[7,2,7,3],[7,4,7,5],[18,13,20,13],[18,20,20,20]]}
[null,null,null,null,null,null,null,null,"Before",null,null,null,null,null,null,"AFTER"]
[null,"Year",8,null,"Amber needs amended when new sheet created",null,null,null,"Allowances:",null,null,null,null,null,null,"Allowances:"]
[null,"Final Year",{"$f":"IF(C2=Inputs!C5,\"Yes\",\"No\")","v":"No"},null,null,null,null,null,"Pers_Allow_Adj",null,null,null,null,null,null,"Pers_Allow_Adj"]
[null,"After Final Year",{"$f":"AND(C2>Inputs!C5)","v":true},null,null,null,null,null,"Tot_Pers_Allow",{"$f":"D22","v":12570},null,null,null,null,null,"Tot_Pers_Allow",{"$f":"F22","v":12570}]
[null,"Investment",{"$f":"CGT!N12","v":0},null,null,null,null,null,"Pers_Sav_Allow",{"$f":"D40","v":1000},null,null,null,null,null,"Pers_Sav_Allow",{"$f":"F40","v":1000}]
[null,"Cum Gain",{"$f":"CGT!N16","v":0}]
{"$rows_left_out":38}
{"sheet":"Yr 9","index":16,"n_rows":43,"n_cols":30,"rows_kept":43,"cut":false,"hidden":true,"merged":[[28,13,30,13],[28,20,30,20],[0,8,0,12],[0,15,0,19],[7,2,7,3],[7,4,7,5],[18,13,20,13],[18,20,20,20]]}
[null,null,null,null,null,null,null,null,"Before",null,null,null,null,null,null,"AFTER"]
[null,"Year",9,null,"Amber needs amended when new sheet created",null,null,null,"Allowances:",null,null,null,null,null,null,"Allowances:"]
[null,"Final Year",{"$f":"IF(C2=Inputs!C5,\"Yes\",\"No\")","v":"No"},null,null,null,null,null,"Pers_Allow_Adj",null,null,null,null,null,null,"Pers_Allow_Adj"]
[null,"After Final Year",{"$f":"AND(C2>Inputs!C5)","v":true},null,null,null,null,null,"Tot_Pers_Allow",{"$f":"D22","v":12570},null,null,null,null,null,"Tot_Pers_Allow",{"$f":"F22","v":12570}]
[null,"Investment",{"$f":"CGT!O12","v":0},null,null,null,null,null,"Pers_Sav_Allow",{"$f":"D40","v":1000},null,null,null,null,null,"Pers_Sav_Allow",{"$f":"F40","v":1000}]
[null,"Cum Gain",{"$f":"CGT!O16","v":0}]
{"$rows_left_out":38}
{"sheet":"Yr 10","index":17,"n_rows":43,"n_cols":30,"rows_kept":43,"cut":false,"hidden":true,"merged":[[28,13,30,13],[28,20,30,20],[0,8,0,12],[0,15,0,19],[7,2,7,3],[7,4,7,5],[18,13,20,13],[18,20,20,20]]}
[null,null,null,null,null,null,null,null,"Before",null,null,null,null,null,null,"AFTER"]
[null,"Year",10,null,"Amber needs amended when new sheet created",null,null,null,"Allowances:",null,null,null,null,null,null,"Allowances:"]
[null,"Final Year",{"$f":"IF(C2=Inputs!C5,\"Yes\",\"No\")","v":"No"},null,null,null,null,null,"Pers_Allow_Adj",null,null,null,null,null,null,"Pers_Allow_Adj"]
[null,"After Final Year",{"$f":"AND(C2>Inputs!C5)","v":true},null,null,null,null,null,"Tot_Pers_Allow",{"$f":"D22","v":12570},null,null,null,null,null,"Tot_Pers_Allow",{"$f":"F22","v":12570}]
[null,"Investment",{"$f":"CGT!P12","v":0},null,null,null,null,null,"Pers_Sav_Allow",{"$f":"D40","v":1000},null,null,null,null,null,"Pers_Sav_Allow",{"$f":"F40","v":1000}]
[null,"Cum Gain",{"$f":"CGT!P16","v":0}]
{"$rows_left_out":38}
{"sheet":"Income","index":18,"n_rows":21,"n_cols":25,"rows_kept":21,"cut":false,"hidden":true,"merged":[[2,9,2,18]]}
[]
[null,null,null,null,null,null,null,null,"Yr"]
[null,null,null,null,null,null,null,null,"Savings Income","Yr"]
[null,null,null,null,null,null,null,null,"Amount",1,2,3,4,5,6,7,8,9,10,"Total"]
[null,null,null,null,null,null,null,null,"Existing",{"$f":"'Yr 1'!$D$10","v":0},{"$f":"'Yr 2'!$D$10","v":0},{"$f":"'Yr 3'!$D$10","v":0},{"$f":"'Yr 4'!$D$10","v":0},{"$f":"'Yr 5'!$D$10","v":0},{"$f":"'Yr 6'!$D$10","v":0},{"$f":"'Yr 7'!$D$10","v":0},{"$f":"'Yr 10'!$D$10","v":0},{"$f":"'Yr 9'!$D$10","v":0},{"$f":"'Yr 10'!$D$10","v":0},{"$f":"SUM(J5:S5)","v":0}]
[null,null,null,null,null,null,null,null,"New",{"$f":"'Yr 1'!$F$12","v":0},{"$f":"'Yr 2'!$F$12","v":0},{"$f":"'Yr 3'!$F$12","v":0},{"$f":"'Yr 4'!$F$12","v":0},{"$f":"'Yr 5'!$F$12","v":0},{"$f":"'Yr 6'!$F$12","v":0},{"$f":"'Yr 7'!$F$12","v":0},{"$f":"'Yr 8'!$F$12","v":0},{"$f":"'Yr 9'!$F$12","v":0},{"$f":"'Yr 10'!$F$12","v":0},{"$f":"SUM(J6:S6)","v":0}]
{"$rows_left_out":16}
{"sheet":"Bonds","index":19,"n_rows":45,"n_cols":27,"rows_kept":45,"cut":false,"hidden":true,"merged":[[5,24,5,26],[2,1,3,13],[27,1,28,13],[5,21,5,23]]}
[]
[null,null,{"$f":"Inputs!B5","v":"Year of encashment (5 to 10 only)"},{"$f":"Inputs!C5","v":0},null,"Post Final Year"]
[null,"ONSHORE"]
[null,null,null,null,null,null,null,null,null,null,null,null,null,null,null,null,null,null,null,null,"For the LOOKUP"]
[null,null,null,null,"Internal Tax",{"$f":"((B10+B16)/SUM(B10:B16)*C11)","v":{"$error":"#DIV/0!"}},null,{"$f":"E8*(1+(SUM(B10:B16))*(1-F5))^D2","v":{"$error":"#DIV/0!"}}]
[null,null,null,null,{"$f":"AND(E7>$D$2)","v":true},{"$f":"AND(F7>$D$2)","v":true},true,true,true,true,true,true,true,{"$f":"AND(N7>$D$2)","v":true},null,null,null,null,null,null,null,"Onshore",null,null,"Offshore"]
{"$rows_left_out":40}
{"sheet":"Onshore Bond Calcs","index":20,"n_rows":76,"n_cols":53,"rows_kept":76,"cut":false,"hidden":true,"merged":[[68,5,68,7],[65,16,65,19],[66,16,66,19],[68,17,68,19],[42,46,44,46],[42,47,42,50],[43,47,43,50],[44,47,44,50],[29,46,39,46],[35,47,35,49],[35,50,39,50],[36,47,36,49],[37,47,37,49],[38,47,38,49],[39,47,39,49],[23,46,24,46],[23,47,23,49],[24,47,24,49],[0,0,0,4],[0,12,0,16],[12,46,12,51],[16,46,22,46],[22,47,22,49]]}
["Before Encashment",null,null,null,null,null,null,null,null,null,null,null,"After Encashment"]
[]
["Full Bond Gain",0,null,null,null,null,null,null,null,null,null,null,"Full Bond Gain",{"$f":"VLOOKUP(Inputs!$C$5,Bonds!U8:AA17,2,FALSE)","v":{"$error":"#N/A"}},null,null,null,null,null,null,null,null,null,null,null,null,null,null,null,null,null,null,null,null,"Slice",{"$f":"VLOOKUP(Inputs!$C$5,Bonds!U8:AA17,3,FALSE)","v":{"$error":"#N/A"}}]
["NSND in Year of encashment",{"$f":"Inputs!$L$11","v":0},null,null,null,null,null,null,null,null,null,null,"NSND in Year of encashment",{"$f":"Inputs!$L$11","v":0},null,null,null,null,null,null,null,null,null,null,null,null,null,null,null,null,null,null,null,null,"NSND in Year of encashment",{"$f":"Inputs!$L$11","v":0}]
["Savings in Year of encashment",{"$f":"Inputs!$L$12","v":0},null,null,null,null,null,null,null,null,null,null,"Savings in Year of encashment",{"$f":"Inputs!$L$12","v":0},null,null,null,null,null,null,null,null,null,null,null,null,null,null,null,null,null,null,null,null,"Savings in Year of encashment",{"$f":"Inputs!$L$12","v":0}]
["Dividend in Year of encashment",{"$f":"Inputs!$L$13","v":0},null,null,null,null,null,null,null,null,null,null,"Dividend in Year of encashment",{"$f":"Inputs!$L$13","v":0},null,null,null,null,null,null,null,null,null,null,null,null,null,null,null,null,null,null,null,null,"Dividend in Year of encashment",{"$f":"Inputs!$L$13","v":0}]
{"$rows_left_out":71}
{"sheet":"Offshore Bond Calcs","index":21,"n_rows":76,"n_cols":54,"rows_kept":76,"cut":false,"hidden":true,"merged":[[29,47,39,47],[35,48,35,50],[42,47,44,47],[42,48,42,51],[43,48,43,51],[44,48,44,51],[35,51,39,51],[36,48,36,50],[37,48,37,50],[38,48,38,50],[39,48,39,50],[65,28,65,31],[68,5,68,7],[68,29,68,31],[1,24,1,28],[65,16,65,19],[66,16,66,19],[68,17,68,19],[66,28,66,31],[0,0,0,4],[12,47,12,52],[16,47,22,47],[22,48,22,50],[23,47,24,47],[23,48,23,50],[24,48,24,50],[1,12,1,18],[0,12,0,52]]}
["Before Encashment",null,null,null,null,null,null,null,null,null,null,null,"After Encashment"]
[null,null,null,null,null,null,null,null,null,null,null,null,"Full gain",null,null,null,null,null,null,null,null,null,null,null,"Calcs for slicing"]
["Full Bond Gain",0,null,null,null,null,null,null,null,null,null,null,"Full Bond Gain",{"$f":"VLOOKUP(Inputs!$C$5,Bonds!U8:AA17,5,FALSE)","v":{"$error":"#N/A"}},null,null,null,null,null,null,null,null,null,null,"Full Bond Gain",{"$f":"VLOOKUP(Inputs!$C$5,Bonds!U8:AA17,5,FALSE)","v":{"$error":"#N/A"}},null,null,null,null,null,null,null,null,null,"Slice",{"$f":"VLOOKUP(Inputs!$C$5,Bonds!U8:AA17,6,FALSE)","v":{"$error":"#N/A"}}]
["NSND in Year of encashment",{"$f":"Inputs!$L$11","v":0},null,null,null,null,null,null,null,null,null,null,"NSND in Year of encashment",{"$f":"Inputs!$L$11","v":0},null,null,null,null,null,null,null,null,null,null,"NSND in Year of encashment",{"$f":"Inputs!$L$11","v":0},null,null,null,null,null,null,null,null,null,"NSND in Year of encashment",{"$f":"Inputs!$L$11","v":0}]
["Savings in Year of encashment",{"$f":"Inputs!$L$12","v":0},null,null,null,null,null,null,null,null,null,null,"Savings in Year of encashment",{"$f":"Inputs!$L$12","v":0},null,null,null,null,null,null,null,null,null,null,"Savings in Year of encashment",{"$f":"Inputs!$L$12","v":0},null,null,null,null,null,null,null,null,null,"Savings in Year of encashment",{"$f":"Inputs!$L$12","v":0}]
["Dividend in Year of encashment",{"$f":"Inputs!$L$13","v":0},null,null,null,null,null,null,null,null,null,null,"Dividend in Year of encashment",{"$f":"Inputs!$L$13","v":0},null,null,null,null,null,null,null,null,null,null,"Dividend in Year of encashment",{"$f":"Inputs!$L$13","v":0},null,null,null,null,null,null,null,null,null,"Dividend in Year of encashment",{"$f":"Inputs!$L$13","v":0}]
{"$rows_left_out":71}
{"sheet":"Port Analysis","index":22,"n_rows":14,"n_cols":9,"rows_kept":14,"cut":false,"hidden":true,"merged":[[11,4,12,4]]}
[]
[null,null,null,null,null,"The gain is only on year 1 basis in cell F9?"]
[]
[null,"Inputs",null,null,"UK (Onshore) Bond"]
[null,"Invested amount",{"$f":"Inputs!C3","v":0}]
[null,"Term",10,null,null,"Amount","Rate","Tax"]
{"$rows_left_out":8}