{"text_format":"1","workbook":"xlsx","n_sheets":7,"sheets":["Rates and Allowances","Workings(Inc Tax)","Summary"," Tax","Corporation Tax","Graph Data","New Format for output"],"not_rendered":{"charts":5,"images":0,"macros":1,"external_links":0,"defined_names":5,"comments":1,"pivot_tables":0},"unopened":[],"bounds":{"document_bytes":16777216,"sheet_cells":100000,"rows_first":2000,"rows_last":500,"rows_between":2000,"halvings":0,"cell_chars":16384,"cell_head_chars":4096},"cells_cut":0,"cells_raw":0,"read":"whole","date_system":"1900"}

{"sheet":"Rates and Allowances","index":0,"n_rows":46,"n_cols":17,"rows_kept":46,"cut":false,"hidden":true,"merged":[[10,0,10,4],[3,11,6,13],[19,8,21,13],[11,14,11,16]]}
["Income Tax ",null,null,null,null,null,null,"Born"]
["Personal Allowance (1)",12570,null,null,null,null,null,"After 5 April 1948",1,10000]
["Income limit for Personal Allowance",100000,null,null,null,null,null,"Before 6 April 1938",2,10660]
["Personal Allowance for people aged 65-74 (1)(2)",10600,{"$f":"B4-B2","v":-1970},null,{"$f":"(C4*2)+B5","v":23760},null,null,"Between 6 April 1938 and 5 April 1948",3,10500,null,"grey boxes not used"]
["Income limit for age-related allowances",27700]
[]
["(1) From the 2010-11 tax year the Personal Allowance reduces where the income is above £100, 000 - by £1 for every £2 of income above the £100,000 limit. This reduction applies irrespective of age."]
["(2) These allowances reduce where the income is above the income limit for age - related allowances - by £1 for every £2 of income above the limit. From the 2010-11 tax year the Personal Allowance "]
["for people aged over 65 can be reduced below the basic Personal Allowance where the income is above £100,000."]
[]
["Income Tax rates and taxable bands SRIT",null,null,null,null,null,null,null,"Inserted for combined results"]
["Rate",null,null,null,null,null,null,null,"SRIT","UKIT","Scot Limit","UK Limit",null,null,"for srit bands"]
["Starter rate",{"$f":"IF(Summary!$F$6=\"Yes\",I13,J13)","v":0},0,"to",{"$f":"IF(Summary!$F$6=\"Yes\",K13,L13)","v":0},null,null,null,0.19,0,2827,0,{"$f":"B2+K13","v":15397},null,15397,12571,{"$f":"O13-P13","v":2826}]
["Basic rate",{"$f":"IF(Summary!$F$6=\"Yes\",I14,J14)","v":0.2},{"$f":"E13","v":0},null,{"$f":"IF(Summary!$F$6=\"Yes\",K14,L14)+E13","v":37700},null,null,null,0.2,0.2,12094,37700,{"$f":"K13+K14+B2","v":27491},null,27491,15398,{"$f":"O14-P14","v":12093}]
["Intermediate rate",{"$f":"IF(Summary!$F$6=\"Yes\",I15,J15)","v":0},{"$f":"E14","v":37700},null,{"$f":"IF(Summary!$F$6=\"Yes\",K15,L15)+E14","v":37700},null,null,null,0.21,0,16171,0,{"$f":"M14+K15","v":43662},null,43662,27492,{"$f":"O15-P15","v":16170}]
["Higher rate",{"$f":"IF(Summary!$F$6=\"Yes\",I16,J16)","v":0.4},{"$f":"E15","v":37700},"to",{"$f":"IF(Summary!$F$6=\"Yes\",K16,L16)+E15","v":37700},null,null,null,0.42,0.4,31338,0,{"$f":"K16+M15","v":75000}]
["Advanced Rate",{"$f":"IF(Summary!$F$6=\"Yes\",I17,J17)","v":0},{"$f":"E16","v":37700},null,{"$f":"IF(Summary!$F$6=\"Yes\",K17,L17)","v":125140},null,null,null,0.45,0,125140,125140]
[{"$f":"IF(Summary!F6=Summary!AA3,\"Top Rate\",\"Additional Rate\")","v":"Additional Rate"},{"$f":"IF(Summary!$F$6=\"Yes\",I18,J18)","v":0.45},"Over ",null,{"$f":"IF(Summary!$F$6=\"Yes\",K18,L18)","v":0},null,null,null,0.48,0.45]
[]
["Dividends - Non devolved",null,null,null,null,null,null,null,"Update this table, not the info on the left"]
{"$rows_left_out":27}
{"sheet":"Workings(Inc Tax)","index":1,"n_rows":29,"n_cols":12,"rows_kept":29,"cut":false,"hidden":true,"merged":[]}
[null,"Existing Position",null,null,null,null,null,"After new contribution"]
[]
[null,"Taxable Income",null,null,null,{"$f":"Summary!F10","v":0},null,"Taxable Income",null,null,null,{"$f":"Summary!F29","v":0}]
[]
[null,null,"Allowances","Still to tax","Allowance balance","tax_sal_bandx_pre",null,null,"Allowances","Still to tax","Allowance balance"]
[null,"Tax Free",{"$f":"' Tax'!E21","v":12570},{"$f":"F3","v":0},{"$f":"MAX(0,C6-F6)","v":12570},{"$f":"IF(F3<C6,F3,C6)","v":0},null,"TaxFree",{"$f":"' Tax'!M21","v":12570},{"$f":"L3","v":0},{"$f":"MAX(0,I6-L6)","v":12570},{"$f":"IF(L3<I6,L3,I6)","v":0}]
[null,"Starter Rate",{"$f":"'Rates and Allowances'!E13-'Rates and Allowances'!C13","v":0},{"$f":"F3-F6","v":0},0,{"$f":"MIN(D7,C7)","v":0},null,"Starter Rate",{"$f":"'Rates and Allowances'!E13-'Rates and Allowances'!C13","v":0},{"$f":"L3-L6","v":0},0,{"$f":"MIN(J7,I7)","v":0}]
[null,"Basic Rate",{"$f":"'Rates and Allowances'!E14-'Rates and Allowances'!C14+Summary!K8","v":37700},{"$f":"MAX(0,D7-F7)","v":0},37700,0,null,"Basic Rate",{"$f":"'Rates and Allowances'!E14-'Rates and Allowances'!C14+Summary!K31","v":37700},{"$f":"MAX(0,J7-L7)","v":0},37700,{"$f":"MIN(J8,I8)","v":0}]
[null,"Intermediate Rate",{"$f":"'Rates and Allowances'!E15-'Rates and Allowances'!C15","v":0},{"$f":"MAX(0,D8-F8)","v":0},0,0,null,"Intermediate Rate",{"$f":"'Rates and Allowances'!E15-'Rates and Allowances'!C15","v":0},{"$f":"MAX(0,J8-L8)","v":0},0,0]
[null,"Higher Rate",{"$f":"'Rates and Allowances'!E16-'Rates and Allowances'!C16","v":0},{"$f":"MAX(0,D9-F9)","v":0},0,0,null,"Higher Rate",{"$f":"'Rates and Allowances'!E16-'Rates and Allowances'!C16","v":0},{"$f":"MAX(0,J9-L9)","v":0},0,0]
[null,"Advanced Rate",{"$f":"'Rates and Allowances'!E17-'Rates and Allowances'!C17","v":87440},{"$f":"MAX(0,D10-F10)","v":0},87440,0,null,"Advanced Rate",{"$f":"'Rates and Allowances'!E17-'Rates and Allowances'!C17","v":87440},{"$f":"MAX(0,J10-L10)","v":0},87440,0]
[null,"Additional Rate       >",{"$f":"'Rates and Allowances'!E18+Summary!K8","v":0},{"$f":"MAX(0,D11-F11)","v":0},0,{"$f":"MIN(D12,C12)","v":0},null,"Additional Rate       >",{"$f":"'Rates and Allowances'!E18+Summary!K31","v":0},{"$f":"MAX(0,J11-L11)","v":0},0,0]
[]
[]
[]
[null,"Dividend",null,null,null,{"$f":"Summary!F12","v":0},null,"Dividend",null,null,null,{"$f":"Summary!F31","v":0}]
[null,"Tax Free",{"$f":"MAX(0,E6)","v":12570},{"$f":"F16","v":0},{"$f":"MIN(E6,E6-F17)*0+MAX(0,C17-D17)","v":12570},{"$f":"MIN(C17,D17)","v":0},null,"Tax Free",{"$f":"MAX(0,K6)","v":12570},{"$f":"L16","v":0},{"$f":"MIN(K6,K6-L17)*0+MAX(0,I17-J17)","v":12570},{"$f":"MIN(I17,J17)","v":0}]
[null,"Divi Allowance",{"$f":"'Rates and Allowances'!B30","v":500},{"$f":"D17-F17","v":0},null,{"$f":"MIN(C18,D18)","v":0},null,"Divi Allowance",{"$f":"'Rates and Allowances'!B30","v":500},{"$f":"J17-L17","v":0},null,{"$f":"MIN(I18,J18)","v":0}]
[null,"Basic Rate",{"$f":"IF((F7+C18)>C29,MAX(0,(E7-F18)),C29-(F7+C18))*0+MAX(0,(E7-C18+IF(D7<C29,MIN(C29-D7,C29-'Rates and Allowances'!E13),0)))","v":37200},{"$f":"D18-F18","v":0},{"$f":"MIN(E7,E7-F18)*0+MAX(0,C19-D19)","v":37200},{"$f":"MIN(C19,D19)","v":0},null,"Basic Rate",{"$f":"IF((L7+I18)>I29,MAX(0,(K7-L18)),I29-(L7+I18))*0+MAX(0,(K7-I18+IF(J7<I29,MIN(I29-J7,I29-'Rates and Allowances'!E13),0)))","v":37200},{"$f":"J18-L18","v":0},{"$f":"MIN(K7,K7-L18)*0+MAX(0,I19-J19)","v":37200},{"$f":"MIN(I19,J19)","v":0}]
[null,"Higher Rate",{"$f":"MAX(0,SUM(E6:E11)-SUM(C17:C19))","v":87440},{"$f":"D19-F19","v":0},{"$f":"MIN(0,C20-D20)*0+MAX(0,C20-D20)","v":87440},{"$f":"MIN(D20,C20)","v":0},null,"Higher Rate",{"$f":"MAX(0,SUM(K6:K11)-SUM(I17:I19))","v":87440},{"$f":"J19-L19","v":0},{"$f":"MIN(0,I20-J20)*0+MAX(0,I20-J20)","v":87440},{"$f":"MIN(J20,I20)","v":0}]
{"$rows_left_out":10}
{"sheet":"Summary","index":2,"n_rows":111,"n_cols":27,"rows_kept":111,"cut":false,"hidden":false,"merged":[[40,3,44,23],[0,16,0,17],[0,3,0,8],[13,21,13,23],[11,8,11,9],[24,8,24,9],[4,21,4,23],[2,16,2,23],[4,8,4,10],[0,9,0,10]]}
["Individuals age",null,null,"Extracting Company Profits Tool\nbuilt by M&G",null,null,null,null,null,null,null,null,null,null,null,null,"Tax Year 2025/26"]
["Between 6 April 1938 and 5 April 1948"]
[null,null,null,null,null,null,null,null,null,null,null,null,null,null,null,null,{"$f":"'New Format for output'!A1","v":"Short Summary"},null,null,null,null,null,null,null,null,null,"Yes"]
[null,null,null,"Pre change position",null,null,null,null,null,null,null,null,null,null,null,null,null,null,null,null,null,null,null,null,null,null,"No"]
[null,null,null,null,null,null,null,null,"Gross value of individuals pension contributions",null,null,null,null,null,null,null,null,{"$f":"'New Format for output'!B2","v":"Pre Change"},null,{"$f":"'New Format for output'!D2","v":"After change"},null,{"$f":"'New Format for output'!F2","v":"Difference"}]
[null,null,null,"Scottish Tax Payer",null,"No",null,null,"Paid gross e.g.OPS, RACs, AVCs",null,0]
[null,null,null,null,null,null,null,null,null,null,null,null,null,null,null,null,{"$f":"'New Format for output'!A4","v":"Individual Bank Account"},{"$f":"'New Format for output'!B4","v":0},null,{"$f":"'New Format for output'!D4","v":0},null,{"$f":"'New Format for output'!F4","v":0},null,{"$f":"'New Format for output'!G4","v":"No change"}]
[null,null,null,"Available Profits",null,0,null,null,"Relief at Source e.g PP,GPP",null,0,null,null,null,null,null,{"$f":"'New Format for output'!A5","v":"Company Bank Account"},{"$f":"'New Format for output'!B5","v":0},null,{"$f":"'New Format for output'!D5","v":0},null,{"$f":"'New Format for output'!F5","v":0},null,{"$f":"'New Format for output'!G5","v":"No change"}]
[null,null,null,null,null,null,null,null,null,null,null,null,null,null,null,null,{"$f":"'New Format for output'!A6","v":"Pension Contributions"},{"$f":"'New Format for output'!B6","v":0},null,{"$f":"'New Format for output'!D6","v":0},null,{"$f":"'New Format for output'!F6","v":0},null,{"$f":"'New Format for output'!G6","v":"No change"}]
[null,null,null,"Salary Paid",null,0,null,null,null,null,null,null,null,null,null,null,{"$f":"'New Format for output'!A7","v":"HMRC total take"},{"$f":"'New Format for output'!B7","v":0},null,{"$f":"'New Format for output'!D7","v":0},null,{"$f":"'New Format for output'!F7","v":0},null,{"$f":"'New Format for output'!G7","v":"No change"}]
[]
[null,null,null,"Dividends Paid",null,0,null,null,"Employer \nContributions",null,0,null,null,null,null,null,{"$f":"'New Format for output'!A10","v":"Detailed View"}]
[]
[null,null,null,null,null,null,null,null,null,null,null,null,null,null,null,null,null,{"$f":"'New Format for output'!B11","v":"Pre Change"},null,{"$f":"'New Format for output'!D11","v":"After change"},null,{"$f":"'New Format for output'!F11","v":"Difference"}]
[null,null,null,null,null,null,null,null,null,null,null,null,null,null,null,null,{"$f":"'New Format for output'!A12","v":"Individual"}]
[null,null,null,"Change (use a - for reductions)"]
[null,null,null,null,null,null,null,null,null,null,null,null,null,null,null,null,{"$f":"'New Format for output'!A14","v":"Salary"},{"$f":"'New Format for output'!B14","v":0},null,{"$f":"'New Format for output'!D14","v":0},null,{"$f":"'New Format for output'!F14","v":0},null,{"$f":"'New Format for output'!G14","v":"No change"}]
[null,null,null,null,null,null,null,null,null,null,null,null,null,null,null,null,{"$f":"'New Format for output'!A15","v":"Plus Dividend received"},{"$f":"'New Format for output'!B15","v":0},null,{"$f":"'New Format for output'!D15","v":0},null,{"$f":"'New Format for output'!F15","v":0},null,{"$f":"'New Format for output'!G15","v":"No change"}]
[null,null,null,"Salary Paid",null,0,null,null,"Paid gross e.g.OPS, RACs, AVCs",null,0,null,{"$f":"IF(K29<0,\"Total pension cannot be negative\",\"\" )","v":""},null,null,null,{"$f":"'New Format for output'!A16","v":"Less Income Tax "},{"$f":"'New Format for output'!B16","v":0},null,{"$f":"'New Format for output'!D16","v":0},null,{"$f":"'New Format for output'!F16","v":0},null,{"$f":"'New Format for output'!G16","v":"No change"}]
[null,null,null,null,null,null,null,null,null,null,null,null,null,null,null,null,{"$f":"'New Format for output'!A17","v":"Less National Insurance"},{"$f":"'New Format for output'!B17","v":0},null,{"$f":"'New Format for output'!D17","v":0},null,{"$f":"'New Format for output'!F17","v":0},null,{"$f":"'New Format for output'!G17","v":"No change"}]
{"$rows_left_out":92}
{"sheet":" Tax","index":3,"n_rows":79,"n_cols":18,"rows_kept":79,"cut":false,"hidden":false,"merged":[[57,7,57,12],[57,1,57,6],[1,1,1,6],[1,8,1,13],[4,16,5,17],[0,8,0,9],[0,1,0,4],[3,1,3,6],[3,8,3,13]]}
[null,"Extracting Company Profits Tool\nbuilt by M&G",null,null,null,null,null,null,null,null,null,{"$f":"Summary!Q1","v":"Tax Year 2025/26"}]
[null,"Pre change Position",null,null,null,null,null,null,"After change Position"]
[]
[null,"Individual",null,null,null,null,null,null,"Individual"]
[null,null,null,null,null,null,null,null,null,null,null,null,null,null,null,null,"KEEP"]
[null,"Allowances",null,null,null,null,null,null,"Allowances"]
[null,"Adjusted Net Income (for allowance purposes)",{"$f":"Summary!F10+Summary!F12-Summary!K6-Summary!K8","v":0},null,null,null,null,null,{"$f":"B7","v":"Adjusted Net Income (for allowance purposes)"},{"$f":"Summary!F29+Summary!F31-Summary!K29-Summary!K31","v":0},null,null,null,null,null,null,{"$f":"C7-'Rates and Allowances'!B3","v":-100000},{"$f":"J7-'Rates and Allowances'!B3","v":-100000}]
[]
[null,"Personal Allowance",{"$f":"'Rates and Allowances'!B2","v":12570},null,null,null,null,null,{"$f":"B9","v":"Personal Allowance"},{"$f":"C9","v":12570}]
[null,"Adjustment",{"$f":"IF(Q7<1,0,(IF(Q7>(2*'Rates and Allowances'!B2),-C9,MAX(-C9,Q7/-2))))","v":0},null,null,null,null,null,{"$f":"B10","v":"Adjustment"},{"$f":"IF(R7<1,0,(IF(R7>(2*'Rates and Allowances'!B2),-J9,MAX(-J9,R7/-2))))","v":0}]
[]
[]
[]
[null,"Total Allowance",{"$f":"C9+C10","v":12570},null,null,null,null,null,{"$f":"B14","v":"Total Allowance"},{"$f":"J9+J10","v":12570}]
[]
[null,"Tax Calculation",null,null,null,null,null,null,{"$f":"B16","v":"Tax Calculation"}]
[]
[null,"Income",null,null,{"$f":"Summary!F10+Summary!F12","v":0},null,null,null,{"$f":"B18","v":"Income"},null,null,null,{"$f":"Summary!F29+Summary!F31","v":0}]
[null,"Less ",null,null,null,null,null,null,{"$f":"B19","v":"Less "}]
[null,"Contributions Paid Gross",{"$f":"Summary!K6","v":0},null,null,null,null,null,{"$f":"B20","v":"Contributions Paid Gross"},null,null,{"$f":"Summary!K29","v":0}]
{"$rows_left_out":60}
{"sheet":"Corporation Tax","index":4,"n_rows":17,"n_cols":12,"rows_kept":17,"cut":false,"hidden":true,"merged":[]}
["Pre change Position",null,null,null,null,null,null,"After change"]
[]
["Taxable Profit (before Salary, NI and Employer Pension Contribution)",null,null,null,{"$f":"Summary!F8","v":0},null,null,"Taxable Profit (before Salary, NI and Employer Pension Contribution)",null,null,null,{"$f":"E3","v":0}]
[]
["Less                                                                         Salary",null,null,{"$f":"Summary!F10","v":0},null,null,null,"Less                                                         Salary",null,null,{"$f":"Summary!F29","v":0}]
["Employers National Insurance",null,null,{"$f":"' Tax'!F78","v":0},null,null,null,"Employers National Insurance",null,null,{"$f":"' Tax'!M78","v":0}]
["Employer Pension Contribution",null,null,{"$f":"Summary!K12","v":0},{"$f":"SUM(D5:D7)","v":0},null,null,"Employer Pension Contribution",null,null,{"$f":"Summary!K33","v":0},{"$f":"SUM(K5:K7)","v":0}]
["Taxable Profit",null,null,null,{"$f":"E3-E7","v":0},null,null,"Taxable Profit",null,null,null,{"$f":"L3-L7","v":0}]
[]
["NB: Dividends are not an allowable expense",null,null,null,null,null,null,"NB: Dividends are not an allowable expense"]
[]
[]
[]
[{"$f":"'Rates and Allowances'!A34","v":"Small Profits Rate"},{"$f":"IF(E8>'Rates and Allowances'!$B$36,0,(MIN('Rates and Allowances'!$B$34,'Corporation Tax'!E8)))","v":0},"@",{"$f":"'Rates and Allowances'!C34","v":0.19},{"$f":"B14*D14","v":0},null,null,{"$f":"A14","v":"Small Profits Rate"},{"$f":"IF(L8>'Rates and Allowances'!$B$36,0,(MIN('Rates and Allowances'!$B$34,'Corporation Tax'!L8)))","v":0},"@",{"$f":"D14","v":0.19},{"$f":"I14*K14","v":0}]
[{"$f":"'Rates and Allowances'!A35","v":"Marginal Rate"},{"$f":"IF(E8>'Rates and Allowances'!$B$36,0,MAX(0,'Corporation Tax'!E8-'Rates and Allowances'!$B$34))","v":0},"@",{"$f":"'Rates and Allowances'!C35","v":0.26500000000000001},{"$f":"B15*D15","v":0},null,null,{"$f":"A15","v":"Marginal Rate"},{"$f":"IF(L8>'Rates and Allowances'!$B$36,0,MAX(0,'Corporation Tax'!L8-'Rates and Allowances'!$B$34))","v":0},"@",{"$f":"D15","v":0.26500000000000001},{"$f":"I15*K15","v":0}]
[{"$f":"'Rates and Allowances'!A36","v":"Main Rate"},{"$f":"IF(E8>'Rates and Allowances'!$B$36,'Corporation Tax'!E8,0)","v":0},"@",{"$f":"'Rates and Allowances'!C36","v":0.25},0,null,null,{"$f":"A16","v":"Main Rate"},{"$f":"IF(L8>'Rates and Allowances'!$B$36,'Corporation Tax'!L8,0)","v":0},"@",0.25,0]
["Tax to pay",null,null,null,{"$f":"MAX(0,SUM(E14:E16))","v":0},null,null,"Tax to pay",null,null,null,{"$f":"MAX(0,SUM(L14:L16))","v":0}]

{"sheet":"Graph Data","index":5,"n_rows":15,"n_cols":3,"rows_kept":15,"cut":false,"hidden":true,"merged":[]}
[null,"Pre change Position","After change"]
["Income Tax",{"$f":"Summary!R61","v":0},{"$f":"Summary!T61","v":0}]
["Employee NI",{"$f":"Summary!R62","v":0},{"$f":"' Tax'!M54","v":0}]
["Employer NI",{"$f":"Summary!R75","v":0},{"$f":"' Tax'!M79","v":0}]
["Corporation Tax",{"$f":"Summary!R73","v":0},{"$f":"'Corporation Tax'!L17","v":0}]
["Profit remaining",{"$f":"Summary!R77","v":0},{"$f":"Summary!T77","v":0}]
["Cash remaining",{"$f":"Summary!R66","v":0},{"$f":"Summary!T66","v":0}]
["Pension Fund",{"$f":"Summary!K6+Summary!K8+Summary!K12","v":0},{"$f":"Summary!K29+Summary!K31+Summary!K33","v":0}]
[]
[null,"Pre change Position","After change"]
["Taxes and NI",{"$f":"B2+B3+B4+B5-(Summary!K8*'Rates and Allowances'!B13)","v":0},{"$f":"C2+C3+C4+C5-((Summary!K31*'Rates and Allowances'!B13))","v":0}]
["Cash and Profit",{"$f":"B7+B6","v":0},{"$f":"C7+C6","v":0}]
["Pension",{"$f":"B8","v":0},{"$f":"C8","v":0}]
[]
[null,{"$f":"SUM(B11:B14)","v":0},{"$f":"SUM(C11:C14)","v":0}]

{"sheet":"New Format for output","index":6,"n_rows":34,"n_cols":22,"rows_kept":34,"cut":false,"hidden":true,"merged":[[1,5,1,6],[10,5,10,6],[3,17,3,18],[3,20,3,21]]}
["Short Summary",null,null,null,null,null,null,"Button to expand this"]
[null,"Pre Change",null,"After change",null,"Difference"]
[]
["Individual Bank Account",{"$f":"B21","v":0},null,{"$f":"D21","v":0},null,{"$f":"F21","v":0},{"$f":"IF((B4-D4)=0,\"No change\",(IF(AND(B4=0,D4>0),\"Infinite Increase\",(D4/B4)-1)))","v":"No change"},null,null,null,null,"Individual",null,null,null,null,null,"Individual",null,null,"Company"]
["Company Bank Account",{"$f":"B31","v":0},null,{"$f":"D31","v":0},null,{"$f":"F31","v":0},{"$f":"IF((B5-D5)=0,\"No change\",(IF(AND(B5=0,D5>0),\"Infinite Increase\",(D5/B5)-1)))","v":"No change"},null,null,null,null,"Before","After",null,null,null,null,"Before","After",null,"Before","After"]
["Pension Contributions",{"$f":"B34","v":0},null,{"$f":"D34","v":0},null,{"$f":"F34","v":0},{"$f":"IF((B6-D6)=0,\"No change\",(IF(AND(B6=0,D6>0),\"Infinite Increase\",(D6/B6)-1)))","v":"No change"},null,null,null,"Pension",{"$f":"B6","v":0},{"$f":"D6","v":0},null,null,null,"Pension",{"$f":"L6","v":0},0]
[{"$f":"Summary!Q90","v":"HMRC total take"},{"$f":"Summary!R90","v":0},null,{"$f":"Summary!T90","v":0},null,{"$f":"Summary!V90","v":0},{"$f":"IF((B7-D7)=0,\"No change\",(IF(AND(B7=0,D7>0),\"Infinite Increase\",(D7/B7)-1)))","v":"No change"},null,null,null,"Tax/NI Paid to HMRC",{"$f":"B16+B17-(B20/4)","v":0},{"$f":"D16+D17-(D20/4)","v":0},"In grey not to be displayed",null,null,"Tax/NI Paid to HMRC",0,0]
[null,null,null,null,null,null,null,null,null,null,"In bank account",{"$f":"B21","v":0},{"$f":"D21","v":0},null,null,null,"In bank account",0,0]
[null,null,null,null,null,null,null,null,null,null,null,null,null,null,null,null,"Tax/NI Paid to HMRC",null,null,null,{"$f":"L15","v":0},0]
["Detailed View",null,null,null,null,null,null,"Button to expand this",null,null,null,null,null,null,null,null,"In Company Bank Account",null,null,null,0,0]
[null,{"$f":"Summary!R56","v":"Pre Change"},null,{"$f":"Summary!T56","v":"After change"},null,{"$f":"Summary!V56","v":"Difference"},null,null,null,null,null,null,null,null,null,null,"Cost of Remuneration",null,null,null,0,0]
[{"$f":"Summary!Q57","v":"Individual"}]
[null,null,null,null,null,null,null,null,null,null,null,"Company"]
[{"$f":"Summary!Q59","v":"Salary"},{"$f":"Summary!R59","v":0},null,{"$f":"Summary!T59","v":0},null,{"$f":"Summary!V59","v":0},{"$f":"IF((B14-D14)=0,\"No change\",(IF(AND(B14=0,D14>0),\"Infinite Increase\",(D14/B14)-1)))","v":"No change"},null,null,null,null,"Before","After"]
[{"$f":"Summary!Q60","v":"Plus Dividend received"},{"$f":"Summary!R60","v":0},null,{"$f":"Summary!T60","v":0},null,{"$f":"Summary!V60","v":0},{"$f":"IF((B15-D15)=0,\"No change\",(IF(AND(B15=0,D15>0),\"Infinite Increase\",(D15/B15)-1)))","v":"No change"},null,null,null,"Tax/NI Paid to HMRC",{"$f":"B28+B30","v":0},{"$f":"D28+D30","v":0}]
[{"$f":"Summary!Q61","v":"Less Income Tax "},{"$f":"Summary!R61","v":0},null,{"$f":"Summary!T61","v":0},null,{"$f":"Summary!V61","v":0},"No change",null,null,null,"In Company Bank Account",{"$f":"B31","v":0},{"$f":"D31","v":0}]
[{"$f":"Summary!Q62","v":"Less National Insurance"},{"$f":"Summary!R62","v":0},null,{"$f":"Summary!T62","v":0},null,{"$f":"Summary!V62","v":0},"No change",null,null,null,"Cost of Remuneration",{"$f":"B27+B29+B26","v":0},{"$f":"D27+D29+D26","v":0}]
[{"$f":"Summary!Q63","v":"Less Contributions gross"},{"$f":"Summary!R63","v":0},null,{"$f":"Summary!T63","v":0},null,{"$f":"Summary!V63","v":0},"No change"]
[{"$f":"Summary!Q64","v":"Net Income"},{"$f":"Summary!R64","v":0},null,{"$f":"Summary!T64","v":0},null,{"$f":"Summary!V64","v":0},"No change"]
[{"$f":"Summary!Q65","v":"Less Contributions paid net"},{"$f":"Summary!R65","v":0},null,{"$f":"Summary!T65","v":0},null,{"$f":"Summary!V65","v":0},"No change"]
{"$rows_left_out":14}